Reaction Details
TargetCoagulation factor XII
LigandBDBM33581
Substrate/Competitorn/a
Meas. Tech.Factor XIIa 1536 HTS Dose Response Confirmation
IC50 936.573333±24.67637 nM
Citation PubChem, PC Factor XIIa 1536 HTS Dose Response Confirmation PubChem Bioassay(2008)[AID]
 
Coagulation factor XII
Name:Coagulation factor XII
Type:Enzyme
Mol. Mass.:67810.07
Organism:Homo sapiens (Human)
Description:P00748
Residue:615
BDBM33581
NameBDBM33581
Synonyms:1-(5-amino-3-pyridin-3-yl-1,2,4-triazol-1-yl)-2-(4-methoxyphenyl)ethanone 1-[(4-methoxyphenyl)acetyl]-3-(3-pyridinyl)-1H-1,2,4-triazol-5-amine 1-[5-amino-3-(3-pyridyl)-1,2,4-triazol-1-yl]-2-(4-methoxyphenyl)ethanone SMR000076607 | cid_970094
TypeSmall organic molecule
Emp. Form.C16H15N5O2
Mol. Mass.309.3226
SMILESCOc1ccc(CC(=O)n2nc(nc2N)-c2cccnc2)cc1