Reaction Details
TargetCoagulation factor XII
LigandBDBM32806
Substrate/Competitorn/a
Meas. Tech.Factor XIIa 1536 HTS Dose Response Confirmation
IC50 755.196667±95.785878 nM
Citation PubChem, PC Factor XIIa 1536 HTS Dose Response Confirmation PubChem Bioassay(2008)[AID]
 
Coagulation factor XII
Name:Coagulation factor XII
Type:Enzyme
Mol. Mass.:67810.07
Organism:Homo sapiens (Human)
Description:P00748
Residue:615
BDBM32806
NameBDBM32806
Synonyms:1-benzotriazolyl-(3,4-dimethoxyphenyl)methanone SMR000102548 cid_743706
TypeSmall organic molecule
Emp. Form.C15H13N3O3
Mol. Mass.283.282
SMILESCOc1ccc(cc1OC)C(=O)n1nnc2ccccc12