Reaction Details
TargetCoagulation factor XII
LigandBDBM33448
Substrate/Competitorn/a
Meas. Tech.Factor XIIa 1536 HTS Dose Response Confirmation
IC50 643.476667±58.960313 nM
Citation PubChem, PC Factor XIIa 1536 HTS Dose Response Confirmation PubChem Bioassay(2008)[AID]
 
Coagulation factor XII
Name:Coagulation factor XII
Type:Enzyme
Mol. Mass.:67810.07
Organism:Homo sapiens (Human)
Description:P00748
Residue:615
BDBM33448
NameBDBM33448
Synonyms:(5-Amino-3-furan-2-yl-[1,2,4]triazol-1-yl)-phenyl-methanone SMR000120480 [5-amino-3-(2-furyl)-1,2,4-triazol-1-yl]-phenyl-methanone [5-azanyl-3-(furan-2-yl)-1,2,4-triazol-1-yl]-phenyl-methanone | cid_828588
TypeSmall organic molecule
Emp. Form.C13H10N4O2
Mol. Mass.254.2441
SMILESNc1nc(nn1C(=O)c1ccccc1)-c1ccco1