Reaction Details
TargetCoagulation factor XII
LigandBDBM32813
Substrate/Competitorn/a
Meas. Tech.Factor XIIa 1536 HTS Dose Response Confirmation
IC50 241.373333±7.003266 nM
Citation PubChem, PC Factor XIIa 1536 HTS Dose Response Confirmation PubChem Bioassay(2008)[AID]
 
Coagulation factor XII
Name:Coagulation factor XII
Type:Enzyme
Mol. Mass.:67810.07
Organism:Homo sapiens (Human)
Description:P00748
Residue:615
BDBM32813
NameBDBM32813
Synonyms:2-(2-chlorophenyl)-4-thieno[3,2-d][1,3]oxazinone 2-(2-chlorophenyl)thieno[3,2-d][1,3]oxazin-4-one SMR000126124 | cid_1485389
TypeSmall organic molecule
Emp. Form.C12H6ClNO2S
Mol. Mass.263.7
SMILESClc1ccccc1-c1nc2ccsc2c(=O)o1