Reaction Details
TargetCoagulation factor XII
LigandBDBM33481
Substrate/Competitorn/a
Meas. Tech.Factor XIIa 1536 HTS Dose Response Confirmation
IC50 92.446667±0.575529 nM
Citation PubChem, PC Factor XIIa 1536 HTS Dose Response Confirmation PubChem Bioassay(2008)[AID]
 
Coagulation factor XII
Name:Coagulation factor XII
Type:Enzyme
Mol. Mass.:67810.07
Organism:Homo sapiens (Human)
Description:P00748
Residue:615
BDBM33481
NameBDBM33481
Synonyms:3-benzamido-1H-1,2,4-triazole-5-carboxylic acid methyl ester SMR000151640 methyl 3-benzamido-1H-1,2,4-triazole-5-carboxylate
TypeSmall organic molecule
Emp. Form.C11H10N4O3
Mol. Mass.246.2221
SMILESCOC(=O)c1nnc(NC(=O)c2ccccc2)[nH]1