Reaction Details
TargetSphingosine 1-phosphate receptor 2
LigandBDBM36923
Substrate/Competitorn/a
Meas. Tech.Counterscreen for S1P2 Antagonists: Dose Response Cell-Based Screen to Identify Antagonists of CRE-BLA
IC50 3707±n/a nM
Citation PubChem, PC Counterscreen for S1P2 Antagonists: Dose Response Cell-Based Screen to Identify Antagonists of CRE-BLA PubChem Bioassay(2008)[AID]
 
Sphingosine 1-phosphate receptor 2
Name:Sphingosine 1-phosphate receptor 2
Type:G Protein-Coupled Receptor (GPCR)
Mol. Mass.:38883.16
Organism:Homo sapiens (Human)
Description:Membranes isolated from S1P2-transfected CHO cells were used in ligand binding assay.
Residue:353
BDBM36923
NameBDBM36923
Synonyms:(Z)-3,4-bis(benzenesulfonyl)-2-buten-1-ol (Z)-3,4-bis(phenylsulfonyl)but-2-en-1-ol MLS000080860 cid_5389617
TypeSmall organic molecule
Emp. Form.C16H16O5S2
Mol. Mass.352.425
SMILESOC\C=C(\CS(=O)(=O)c1ccccc1)S(=O)(=O)c1ccccc1