Reaction Details
TargetSphingosine 1-phosphate receptor 2
LigandBDBM38993
Substrate/Competitorn/a
Meas. Tech.Counterscreen for S1P2 Antagonists: Dose Response Cell-Based Screen to Identify Antagonists of CRE-BLA
IC50 1964±n/a nM
Citation PubChem, PC Counterscreen for S1P2 Antagonists: Dose Response Cell-Based Screen to Identify Antagonists of CRE-BLA PubChem Bioassay(2008)[AID]
 
Sphingosine 1-phosphate receptor 2
Name:Sphingosine 1-phosphate receptor 2
Type:G Protein-Coupled Receptor (GPCR)
Mol. Mass.:38883.16
Organism:Homo sapiens (Human)
Description:Membranes isolated from S1P2-transfected CHO cells were used in ligand binding assay.
Residue:353
BDBM38993
NameBDBM38993
Synonyms:(1Z,3Z)-1,4-bis(butylsulfonyl)buta-1,3-diene SMR000020833 | cid_5286934
TypeSmall organic molecule
Emp. Form.C12H22O4S2
Mol. Mass.294.431
SMILESCCCCS(=O)(=O)\C=C/C=C\S(=O)(=O)CCCC