Reaction Details
TargetSerine/threonine-protein kinase PLK1
LigandBDBM41764
Substrate/Competitorn/a
Meas. Tech.Concentration Response Redox Cycling H2O2 Generation assay, 1 mM DTT, to characterize small molecule inhibitors identified in the Polo box domain (PBD) of Plk1 Primary HTS.
EC50>50000±n/a nM
Citation PubChem, PC Concentration Response Redox Cycling H2O2 Generation assay, 1 mM DTT, to characterize small molecule inhibitors identified in the Polo box domain (PBD) of Plk1 Primary HTS. PubChem Bioassay(2007)[AID]
 
Serine/threonine-protein kinase PLK1
Name:Serine/threonine-protein kinase PLK1
Type:Serine/threonine-protein kinase
Mol. Mass.:68277.16
Organism:Homo sapiens (Human)
Description:P53350
Residue:603
BDBM41764
NameBDBM41764
Synonyms:3-(4-keto-6-methyl-2-thioxo-1H-pyrimidin-5-yl)propionic acid methyl ester MLS000077573 cid_660631 methyl 3-(6-methyl-4-oxo-2-sulfanylidene-1H-pyrimidin-5-yl)propanoate
TypeSmall organic molecule
Emp. Form.C9H12N2O3S
Mol. Mass.228.268
SMILESCOC(=O)CCc1c(C)[nH]c(=S)[nH]c1=O