Reaction Details
TargetSerine/threonine-protein kinase PLK1
LigandBDBM41780
Substrate/Competitorn/a
Meas. Tech.Concentration Response Redox Cycling H2O2 Generation assay, 1 mM DTT, to characterize small molecule inhibitors identified in the Polo box domain (PBD) of Plk1 Primary HTS.
EC50>50000±n/a nM
Citation PubChem, PC Concentration Response Redox Cycling H2O2 Generation assay, 1 mM DTT, to characterize small molecule inhibitors identified in the Polo box domain (PBD) of Plk1 Primary HTS. PubChem Bioassay(2007)[AID]
 
Serine/threonine-protein kinase PLK1
Name:Serine/threonine-protein kinase PLK1
Type:Serine/threonine-protein kinase
Mol. Mass.:68277.16
Organism:Homo sapiens (Human)
Description:P53350
Residue:603
BDBM41780
NameBDBM41780
Synonyms:MLS000086701 N-[4-(3-isopropoxypropylcarbamoyl)phenyl]tetrahydrofuran-2-carboxamide N-[4-[oxo-(3-propan-2-yloxypropylamino)methyl]phenyl]-2-oxolanecarboxamide cid_3244061
TypeSmall organic molecule
Emp. Form.C18H26N2O4
Mol. Mass.334.41
SMILESCC(C)OCCCNC(=O)c1ccc(NC(=O)C2CCCO2)cc1