Reaction Details
TargetSerine/threonine-protein kinase PLK1
LigandBDBM41799
Substrate/Competitorn/a
Meas. Tech.Concentration Response Redox Cycling H2O2 Generation assay, 1 mM DTT, to characterize small molecule inhibitors identified in the Polo box domain (PBD) of Plk1 Primary HTS.
EC50>50000±n/a nM
Citation PubChem, PC Concentration Response Redox Cycling H2O2 Generation assay, 1 mM DTT, to characterize small molecule inhibitors identified in the Polo box domain (PBD) of Plk1 Primary HTS. PubChem Bioassay(2007)[AID]
 
Serine/threonine-protein kinase PLK1
Name:Serine/threonine-protein kinase PLK1
Type:Serine/threonine-protein kinase
Mol. Mass.:68277.16
Organism:Homo sapiens (Human)
Description:P53350
Residue:603
BDBM41799
NameBDBM41799
Synonyms:2-[[4-[(1-ethyl-5-methyl-pyrazol-4-yl)methyl]piperazine-1-carbonyl]amino]benzoic acid methyl ester MLS000097106 cid_2206454 methyl 2-[[4-[(1-ethyl-5-methyl-pyrazol-4-yl)methyl]piperazin-1-yl]carbonylamino]benzoate | methyl 2-[[4-[(1-ethyl-5-methylpyrazol-4-yl)methyl]piperazine-1-carbonyl]amino]benzoate
TypeSmall organic molecule
Emp. Form.C20H27N5O3
Mol. Mass.385.4601
SMILESCCn1ncc(CN2CCN(CC2)C(=O)Nc2ccccc2C(=O)OC)c1C