Reaction Details
TargetSerine/threonine-protein kinase PLK1
LigandBDBM41807
Substrate/Competitorn/a
Meas. Tech.Concentration Response Redox Cycling H2O2 Generation assay, 1 mM DTT, to characterize small molecule inhibitors identified in the Polo box domain (PBD) of Plk1 Primary HTS.
EC50>50000±n/a nM
Citation PubChem, PC Concentration Response Redox Cycling H2O2 Generation assay, 1 mM DTT, to characterize small molecule inhibitors identified in the Polo box domain (PBD) of Plk1 Primary HTS. PubChem Bioassay(2007)[AID]
 
Serine/threonine-protein kinase PLK1
Name:Serine/threonine-protein kinase PLK1
Type:Serine/threonine-protein kinase
Mol. Mass.:68277.16
Organism:Homo sapiens (Human)
Description:P53350
Residue:603
BDBM41807
NameBDBM41807
Synonyms:3-[(3-methylcyclohexyl)amino]-2-azepanone MLS000106622 cid_2846276
TypeSmall organic molecule
Emp. Form.C13H24N2O
Mol. Mass.224.3425
SMILESCC1CCCC(C1)NC1CCCCNC1=O