Reaction Details
TargetSerine/threonine-protein kinase PLK1
LigandBDBM41823
Substrate/Competitorn/a
Meas. Tech.Concentration Response Redox Cycling H2O2 Generation assay, 1 mM DTT, to characterize small molecule inhibitors identified in the Polo box domain (PBD) of Plk1 Primary HTS.
EC50>50000±n/a nM
Citation PubChem, PC Concentration Response Redox Cycling H2O2 Generation assay, 1 mM DTT, to characterize small molecule inhibitors identified in the Polo box domain (PBD) of Plk1 Primary HTS. PubChem Bioassay(2007)[AID]
 
Serine/threonine-protein kinase PLK1
Name:Serine/threonine-protein kinase PLK1
Type:Serine/threonine-protein kinase
Mol. Mass.:68277.16
Organism:Homo sapiens (Human)
Description:P53350
Residue:603
BDBM41823
NameBDBM41823
Synonyms:MLS000538265 N-cyclohexyl-2-(propanoylamino)benzamide N-cyclohexyl-2-propionamido-benzamide cid_974692
TypeSmall organic molecule
Emp. Form.C16H22N2O2
Mol. Mass.274.3581
SMILESCCC(=O)Nc1ccccc1C(=O)NC1CCCCC1