Reaction Details
TargetSerine/threonine-protein kinase PLK1
LigandBDBM41826
Substrate/Competitorn/a
Meas. Tech.Concentration Response Redox Cycling H2O2 Generation assay, 1 mM DTT, to characterize small molecule inhibitors identified in the Polo box domain (PBD) of Plk1 Primary HTS.
EC50>50000±n/a nM
Citation PubChem, PC Concentration Response Redox Cycling H2O2 Generation assay, 1 mM DTT, to characterize small molecule inhibitors identified in the Polo box domain (PBD) of Plk1 Primary HTS. PubChem Bioassay(2007)[AID]
 
Serine/threonine-protein kinase PLK1
Name:Serine/threonine-protein kinase PLK1
Type:Serine/threonine-protein kinase
Mol. Mass.:68277.16
Organism:Homo sapiens (Human)
Description:P53350
Residue:603
BDBM41826
NameBDBM41826
Synonyms:2-[[(4E)-1-keto-4-(2-thienylsulfonylimino)-2-naphthyl]amino]benzoic acid methyl ester MLS000521465 cid_9550941 methyl 2-[[(4E)-1-oxo-4-thiophen-2-ylsulfonyliminonaphthalen-2-yl]amino]benzoate
TypeSmall organic molecule
Emp. Form.C22H16N2O5S2
Mol. Mass.452.503
SMILESCOC(=O)c1ccccc1NC1=CC(=NS(=O)(=O)c2cccs2)c2ccccc2C1=O