Reaction Details
TargetAlkaline phosphatase, tissue-nonspecific isozyme
LigandBDBM50132133
Substrate/Competitorn/a
Meas. Tech.SAR analysis of an In Vitro TNAP Dose Response Luminescent Assay
IC50 8710±n/a nM
Citation PubChem, PC SAR analysis of an In Vitro TNAP Dose Response Luminescent Assay PubChem Bioassay(2010)[AID]
 
Alkaline phosphatase, tissue-nonspecific isozyme
Name:Alkaline phosphatase, tissue-nonspecific isozyme
Type:PROTEIN
Mol. Mass.:57306.17
Organism:Homo sapiens (Human)
Description:ChEMBL_1448917
Residue:524
BDBM50132133
NameBDBM50132133
Synonyms:5-p-Tolyl-1H-pyrazole-3-carboxylic acid cid_818267
TypeSmall organic molecule
Emp. Form.C11H10N2O2
Mol. Mass.202.2093
SMILESCc1ccc(cc1)-c1cc([nH]n1)C(O)=O