Reaction Details
TargetAlkaline phosphatase, tissue-nonspecific isozyme
LigandBDBM39617
Substrate/Competitorn/a
Meas. Tech.SAR analysis of an In Vitro TNAP Dose Response Luminescent Assay
IC50>100000±n/a nM
Citation PubChem, PC SAR analysis of an In Vitro TNAP Dose Response Luminescent Assay PubChem Bioassay(2010)[AID]
 
Alkaline phosphatase, tissue-nonspecific isozyme
Name:Alkaline phosphatase, tissue-nonspecific isozyme
Type:PROTEIN
Mol. Mass.:57306.17
Organism:Homo sapiens (Human)
Description:ChEMBL_1448917
Residue:524
BDBM39617
NameBDBM39617
Synonyms:3-[5-(methylamino)-1,3,4-thiadiazol-2-yl]-1-benzopyran-2-one 3-[5-(methylamino)-1,3,4-thiadiazol-2-yl]chromen-2-one MLS000094728 cid_3244772
TypeSmall organic molecule
Emp. Form.C12H9N3O2S
Mol. Mass.259.284
SMILESCNc1nnc(s1)-c1cc2ccccc2oc1=O