Reaction Details
TargetTyrosine-protein phosphatase non-receptor type 7
LigandBDBM46191
Substrate/Competitorn/a
Meas. Tech.Fluorescent secondary assay for dose-response confirmation of chemical inhibitors of HePTP
IC50 2140±n/a nM
Citation PubChem, PC Fluorescent secondary assay for dose-response confirmation of chemical inhibitors of HePTP PubChem Bioassay(2009)[AID]
 
Tyrosine-protein phosphatase non-receptor type 7
Name:Tyrosine-protein phosphatase non-receptor type 7
Type:Protein
Mol. Mass.:40530.79
Organism:Homo sapiens (Human)
Description:P35236
Residue:360
BDBM46191
NameBDBM46191
Synonyms:1-[2,3-bis(2-furanyl)-6-quinoxalinyl]-3-(4-chlorophenyl)urea 1-[2,3-bis(furan-2-yl)quinoxalin-6-yl]-3-(4-chlorophenyl)urea cid_24178225
TypeSmall organic molecule
Emp. Form.C23H15ClN4O3
Mol. Mass.430.843
SMILESClc1ccc(NC(=O)Nc2ccc3nc(-c4ccco4)c(nc3c2)-c2ccco2)cc1