Reaction Details
TargetTyrosine-protein phosphatase non-receptor type 7
LigandBDBM46222
Substrate/Competitorn/a
Meas. Tech.Fluorescent secondary assay for dose-response confirmation of chemical inhibitors of HePTP
IC50 1172±n/a nM
Citation PubChem, PC Fluorescent secondary assay for dose-response confirmation of chemical inhibitors of HePTP PubChem Bioassay(2009)[AID]
 
Tyrosine-protein phosphatase non-receptor type 7
Name:Tyrosine-protein phosphatase non-receptor type 7
Type:Protein
Mol. Mass.:40530.79
Organism:Homo sapiens (Human)
Description:P35236
Residue:360
BDBM46222
NameBDBM46222
Synonyms:3-(3-chloranyl-4-methoxy-phenyl)-1-(3-methylbutyl)-1-(1-propan-2-ylpiperidin-4-yl)thiourea 3-(3-chloro-4-methoxyphenyl)-1-(3-methylbutyl)-1-(1-propan-2-yl-4-piperidinyl)thiourea MLS-0330044.0001 | cid_24761488
TypeSmall organic molecule
Emp. Form.C21H34ClN3OS
Mol. Mass.412.032
SMILESCOc1ccc(NC(=S)N(CCC(C)C)C2CCN(CC2)C(C)C)cc1Cl