Reaction Details
TargetTyrosine-protein phosphatase non-receptor type 7
LigandBDBM46235
Substrate/Competitorn/a
Meas. Tech.Fluorescent secondary assay for dose-response confirmation of chemical inhibitors of HePTP
IC50 2286±n/a nM
Citation PubChem, PC Fluorescent secondary assay for dose-response confirmation of chemical inhibitors of HePTP PubChem Bioassay(2009)[AID]
 
Tyrosine-protein phosphatase non-receptor type 7
Name:Tyrosine-protein phosphatase non-receptor type 7
Type:Protein
Mol. Mass.:40530.79
Organism:Homo sapiens (Human)
Description:P35236
Residue:360
BDBM46235
NameBDBM46235
Synonyms:4-[[2-bromanyl-4-[(E)-2-cyano-2-(3-fluorophenyl)ethenyl]phenoxy]methyl]benzoic acid 4-[[2-bromo-4-[(E)-2-cyano-2-(3-fluorophenyl)vinyl]phenoxy]methyl]benzoic acid cid_2229326
TypeSmall organic molecule
Emp. Form.C23H15BrFNO3
Mol. Mass.452.273
SMILESOC(=O)c1ccc(COc2ccc(\C=C(\C#N)c3cccc(F)c3)cc2Br)cc1