Reaction Details
TargetTyrosine-protein phosphatase non-receptor type 7
LigandBDBM46243
Substrate/Competitorn/a
Meas. Tech.Fluorescent secondary assay for dose-response confirmation of chemical inhibitors of HePTP
IC50 33093±n/a nM
Citation PubChem, PC Fluorescent secondary assay for dose-response confirmation of chemical inhibitors of HePTP PubChem Bioassay(2009)[AID]
 
Tyrosine-protein phosphatase non-receptor type 7
Name:Tyrosine-protein phosphatase non-receptor type 7
Type:Protein
Mol. Mass.:40530.79
Organism:Homo sapiens (Human)
Description:P35236
Residue:360
BDBM46243
NameBDBM46243
Synonyms:4-[[2-chloranyl-4-[(E)-2-cyano-2-(3-fluorophenyl)ethenyl]-6-ethoxy-phenoxy]methyl]benzoic acid 4-[[2-chloro-4-[(E)-2-cyano-2-(3-fluorophenyl)vinyl]-6-ethoxy-phenoxy]methyl]benzoic acid cid_2230267
TypeSmall organic molecule
Emp. Form.C25H19ClFNO4
Mol. Mass.451.874
SMILESCCOc1cc(\C=C(\C#N)c2cccc(F)c2)cc(Cl)c1OCc1ccc(cc1)C(O)=O