Reaction Details
TargetTyrosine-protein phosphatase non-receptor type 7
LigandBDBM46270
Substrate/Competitorn/a
Meas. Tech.Fluorescent secondary assay for dose-response confirmation of chemical inhibitors of HePTP
IC50 3100±n/a nM
Citation PubChem, PC Fluorescent secondary assay for dose-response confirmation of chemical inhibitors of HePTP PubChem Bioassay(2009)[AID]
 
Tyrosine-protein phosphatase non-receptor type 7
Name:Tyrosine-protein phosphatase non-receptor type 7
Type:Protein
Mol. Mass.:40530.79
Organism:Homo sapiens (Human)
Description:P35236
Residue:360
BDBM46270
NameBDBM46270
Synonyms:2-[2-chloranyl-4-[(Z)-[2-[(4-ethylphenyl)amino]-4-oxidanylidene-1,3-thiazol-5-ylidene]methyl]phenoxy]ethanoic acid 2-[2-chloro-4-[(Z)-[2-(4-ethylanilino)-4-oxo-1,3-thiazol-5-ylidene]methyl]phenoxy]acetic acid MLS-0425585.0001 | cid_1737079
TypeSmall organic molecule
Emp. Form.C20H17ClN2O4S
Mol. Mass.416.878
SMILESCCc1ccc(NC2=NC(=O)C(S2)=Cc2ccc(OCC(O)=O)c(Cl)c2)cc1