Reaction Details
TargetTyrosine-protein phosphatase non-receptor type 7
LigandBDBM46276
Substrate/Competitorn/a
Meas. Tech.Fluorescent secondary assay for dose-response confirmation of chemical inhibitors of HePTP
IC50 4637±n/a nM
Citation PubChem, PC Fluorescent secondary assay for dose-response confirmation of chemical inhibitors of HePTP PubChem Bioassay(2009)[AID]
 
Tyrosine-protein phosphatase non-receptor type 7
Name:Tyrosine-protein phosphatase non-receptor type 7
Type:Protein
Mol. Mass.:40530.79
Organism:Homo sapiens (Human)
Description:P35236
Residue:360
BDBM46276
NameBDBM46276
Synonyms:2-[2,6-bis(chloranyl)-4-[(Z)-[6-ethoxycarbonyl-5-(3-methoxyphenyl)-7-methyl-3-oxidanylidene-5H-[1,3]thiazolo[3,2-a]pyrimidin-2-ylidene]methyl]phenoxy]ethanoic acid 2-[2,6-dichloro-4-[(Z)-[6-ethoxycarbonyl-5-(3-methoxyphenyl)-7-methyl-3-oxo-5H-thiazolo[3,2-a]pyrimidin-2-ylidene]methyl]phenoxy]acetic acid MLS-0425590.0001 | cid_6000533
TypeSmall organic molecule
Emp. Form.C26H22Cl2N2O7S
Mol. Mass.577.433
SMILESCCOC(=O)C1=C(C)N=c2s\c(=C/c3cc(Cl)c(OCC(O)=O)c(Cl)c3)c(=O)n2C1c1cccc(OC)c1