Reaction Details
TargetHeat shock cognate 71 kDa protein
LigandBDBM31732
Substrate/Competitorn/a
Meas. Tech.In Vitro Hsc70 Dose Response Fluorescence Polarization Assay
IC50 20200±1490 nM
Citation PubChem, PC In Vitro Hsc70 Dose Response Fluorescence Polarization Assay PubChem Bioassay(2008)[AID]
 
Heat shock cognate 71 kDa protein
Name:Heat shock cognate 71 kDa protein
Type:Enzyme Catalytic Domain
Mol. Mass.:70887.67
Organism:Homo sapiens (Human)
Description:gi_5729877
Residue:646
BDBM31732
NameBDBM31732
Synonyms:6-(trifluoromethyl)-3a,4,5,9b-tetrahydro-3H-cyclopenta[c]quinoline-4-carboxylic acid cid_617227
TypeSmall organic molecule
Emp. Form.C14H12F3NO2
Mol. Mass.283.2458
SMILESOC(=O)C1Nc2c(cccc2C(F)(F)F)C2C=CCC12