Reaction Details
TargetHeat shock cognate 71 kDa protein
LigandBDBM31748
Substrate/Competitorn/a
Meas. Tech.In Vitro Hsc70 Dose Response Fluorescence Polarization Assay
IC50 175000±23000 nM
Citation PubChem, PC In Vitro Hsc70 Dose Response Fluorescence Polarization Assay PubChem Bioassay(2008)[AID]
 
Heat shock cognate 71 kDa protein
Name:Heat shock cognate 71 kDa protein
Type:Enzyme Catalytic Domain
Mol. Mass.:70887.67
Organism:Homo sapiens (Human)
Description:gi_5729877
Residue:646
BDBM31748
NameBDBM31748
Synonyms:8-chloranyl-9-nitro-6-oxidanyl-3a,4,5,9b-tetrahydro-3H-cyclopenta[c]quinoline-4-carboxylic acid MLS-0111541.0001 cid_3453217
TypeSmall organic molecule
Emp. Form.C13H11ClN2O5
Mol. Mass.310.69
SMILESOC(=O)C1Nc2c(O)cc(Cl)c(c2C2C=CCC12)[N+]([O-])=O