Reaction Details
TargetHeat shock cognate 71 kDa protein
LigandBDBM29615
Substrate/Competitorn/a
Meas. Tech.In Vitro Hsc70 Dose Response Fluorescence Polarization Assay
IC50 25200±2070 nM
Citation PubChem, PC In Vitro Hsc70 Dose Response Fluorescence Polarization Assay PubChem Bioassay(2008)[AID]
 
Heat shock cognate 71 kDa protein
Name:Heat shock cognate 71 kDa protein
Type:Enzyme Catalytic Domain
Mol. Mass.:70887.67
Organism:Homo sapiens (Human)
Description:gi_5729877
Residue:646
BDBM29615
NameBDBM29615
Synonyms:6-methoxy-3a,4,5,9b-tetrahydro-3H-cyclopenta[c]quinoline-4-carboxylic acid SMR000009698 cid_652912
TypeSmall organic molecule
Emp. Form.C14H15NO3
Mol. Mass.245.2738
SMILESCOc1cccc2C3C=CCC3C(Nc12)C(O)=O