Reaction Details
TargetGlutathione S-transferase Mu 1
LigandBDBM43201
Substrate/Competitorn/a
Meas. Tech.Profiling Assay to determine GST-GSH interactions in multiplex bead-based assays (HPSMTB buffer)
EC50 21390±n/a nM
Citation PubChem, PC Profiling Assay to determine GST-GSH interactions in multiplex bead-based assays (HPSMTB buffer) PubChem Bioassay(2008)[AID]
 
Glutathione S-transferase Mu 1
Name:Glutathione S-transferase Mu 1
Type:PROTEIN
Mol. Mass.:25712.03
Organism:Homo sapiens (Human)
Description:ChEMBL_799596
Residue:218
BDBM43201
NameBDBM43201
Synonyms:(2Z,4S,6S,12aS)-4-(dimethylamino)-6,10,11,12a-tetrahydroxy-2-[hydroxy-(1-pyrrolidinylmethylamino)methylidene]-6-methyl-4,4a,5,5a-tetrahydrotetracene-1,3,12-trione (2Z,4S,6S,12aS)-4-(dimethylamino)-6,10,11,12a-tetrahydroxy-2-[hydroxy-(pyrrolidinomethylamino)methylene]-6-methyl-4,4a,5,5a-tetrahydrotetracene-1,3,12-trione MLS000028710 SMR000058701 | cid_6420073
TypeSmall organic molecule
Emp. Form.C27H33N3O8
Mol. Mass.527.5662
SMILESCN(C)[C@H]1C2CC3C(C(=O)c4c(O)cccc4[C@@]3(C)O)C(=O)[C@]2(O)C(=O)C(C(=O)NCN2CCCC2)C1=O