Reaction Details
TargetGlutathione S-transferase Mu 1
LigandBDBM50106345
Substrate/Competitorn/a
Meas. Tech.Profiling Assay to determine GST-GSH interactions in multiplex bead-based assays (HPSMTB buffer)
EC50 37270±n/a nM
Citation PubChem, PC Profiling Assay to determine GST-GSH interactions in multiplex bead-based assays (HPSMTB buffer) PubChem Bioassay(2008)[AID]
 
Glutathione S-transferase Mu 1
Name:Glutathione S-transferase Mu 1
Type:PROTEIN
Mol. Mass.:25712.03
Organism:Homo sapiens (Human)
Description:ChEMBL_799596
Residue:218
BDBM50106345
NameBDBM50106345
Synonyms:4-(4-Methyl-piperazin-1-yl)-phenylamine cid_737253
TypeSmall organic molecule
Emp. Form.C11H17N3
Mol. Mass.191.2728
SMILESCN1CCN(CC1)c1ccc(N)cc1