Reaction Details
TargetGlutathione S-transferase Mu 1
LigandBDBM32285
Substrate/Competitorn/a
Meas. Tech.Profiling Assay to determine GST-GSH interactions in multiplex bead-based assays (HPSMTB buffer)
EC50 2360±n/a nM
Citation PubChem, PC Profiling Assay to determine GST-GSH interactions in multiplex bead-based assays (HPSMTB buffer) PubChem Bioassay(2008)[AID]
 
Glutathione S-transferase Mu 1
Name:Glutathione S-transferase Mu 1
Type:PROTEIN
Mol. Mass.:25712.03
Organism:Homo sapiens (Human)
Description:ChEMBL_799596
Residue:218
BDBM32285
NameBDBM32285
Synonyms:(4E)-2-methoxy-4-[([1,2,4]triazolo[3,4-a]phthalazin-6-ylhydrazo)methylidene]-1-cyclohexa-2,5-dienone (4E)-2-methoxy-4-[[N'-([1,2,4]triazolo[3,4-a]phthalazin-6-yl)hydrazino]methylene]cyclohexa-2,5-dien-1-one SMR000131930 | cid_11957199
TypeSmall organic molecule
Emp. Form.C17H14N6O2
Mol. Mass.334.3321
SMILESCOc1cc(CN=Nc2nn3cnnc3c3ccccc23)ccc1O