Reaction Details
TargetGlutathione S-transferase Mu 1
LigandBDBM32288
Substrate/Competitorn/a
Meas. Tech.Profiling Assay to determine GST-GSH interactions in multiplex bead-based assays (HPSMTB buffer)
EC50 3160±n/a nM
Citation PubChem, PC Profiling Assay to determine GST-GSH interactions in multiplex bead-based assays (HPSMTB buffer) PubChem Bioassay(2008)[AID]
 
Glutathione S-transferase Mu 1
Name:Glutathione S-transferase Mu 1
Type:PROTEIN
Mol. Mass.:25712.03
Organism:Homo sapiens (Human)
Description:ChEMBL_799596
Residue:218
BDBM32288
NameBDBM32288
Synonyms:(1,1-diketo-1,2-benzothiazol-3-yl)-methyl-(4-pyridylmethyleneamino)amine N-methyl-1,1-bis(oxidanylidene)-N-(pyridin-4-ylmethylideneamino)-1,2-benzothiazol-3-amine SMR000162295 isonicotinaldehyde (1,1-dioxido-1,2-benzisothiazol-3-yl)(methyl)hydrazone
TypeSmall organic molecule
Emp. Form.C14H12N4O2S
Mol. Mass.300.336
SMILESCN(N=Cc1ccncc1)C1=NS(=O)(=O)c2ccccc12