Reaction Details
TargetGlutathione S-transferase Mu 1
LigandBDBM32304
Substrate/Competitorn/a
Meas. Tech.Profiling Assay to determine GST-GSH interactions in multiplex bead-based assays (HPSMTB buffer)
EC50 29800±n/a nM
Citation PubChem, PC Profiling Assay to determine GST-GSH interactions in multiplex bead-based assays (HPSMTB buffer) PubChem Bioassay(2008)[AID]
 
Glutathione S-transferase Mu 1
Name:Glutathione S-transferase Mu 1
Type:PROTEIN
Mol. Mass.:25712.03
Organism:Homo sapiens (Human)
Description:ChEMBL_799596
Residue:218
BDBM32304
NameBDBM32304
Synonyms:6-(2,5-dimethoxyphenyl)benzo[d][2]benzazepine-5,7-dione MLS000723361 cid_2892892
TypeSmall organic molecule
Emp. Form.C22H17NO4
Mol. Mass.359.3747
SMILESCOc1ccc(OC)c(c1)-n1c(=O)c2ccccc2c2ccccc2c1=O