Reaction Details
TargetGlutathione S-transferase Mu 1
LigandBDBM32307
Substrate/Competitorn/a
Meas. Tech.Profiling Assay to determine GST-GSH interactions in multiplex bead-based assays (HPSMTB buffer)
EC50 18540±n/a nM
Citation PubChem, PC Profiling Assay to determine GST-GSH interactions in multiplex bead-based assays (HPSMTB buffer) PubChem Bioassay(2008)[AID]
 
Glutathione S-transferase Mu 1
Name:Glutathione S-transferase Mu 1
Type:PROTEIN
Mol. Mass.:25712.03
Organism:Homo sapiens (Human)
Description:ChEMBL_799596
Residue:218
BDBM32307
NameBDBM32307
Synonyms:4-chloro-3-nitro-benzoic acid [4-keto-6-[[(4-methylpyrimidin-2-yl)thio]methyl]pyran-3-yl] ester MLS000696790 [6-[(4-methylpyrimidin-2-yl)sulfanylmethyl]-4-oxidanylidene-pyran-3-yl] 4-chloranyl-3-nitro-benzoate cid_12005992
TypeSmall organic molecule
Emp. Form.C18H12ClN3O6S
Mol. Mass.433.822
SMILESCc1ccnc(SCc2cc(=O)c(OC(=O)c3ccc(Cl)c(c3)[N+]([O-])=O)co2)n1