Reaction Details
TargetGlutathione S-transferase Mu 1
LigandBDBM32315
Substrate/Competitorn/a
Meas. Tech.Profiling Assay to determine GST-GSH interactions in multiplex bead-based assays (HPSMTB buffer)
EC50 5110±n/a nM
Citation PubChem, PC Profiling Assay to determine GST-GSH interactions in multiplex bead-based assays (HPSMTB buffer) PubChem Bioassay(2008)[AID]
 
Glutathione S-transferase Mu 1
Name:Glutathione S-transferase Mu 1
Type:PROTEIN
Mol. Mass.:25712.03
Organism:Homo sapiens (Human)
Description:ChEMBL_799596
Residue:218
BDBM32315
NameBDBM32315
Synonyms:CHEMBL1345690 SMR000277368 | cid_5522952
TypeSmall organic molecule
Emp. Form.C19H13NO4
Mol. Mass.319.3108
SMILESCCOC(=O)c1c2-c3ccccc3C(=O)c3cccc([nH]c1=O)c23