Reaction Details
TargetGlutathione S-transferase Mu 1
LigandBDBM33162
Substrate/Competitorn/a
Meas. Tech.Profiling Assay to determine GST-GSH interactions in multiplex bead-based assays (HPSMTB buffer)
EC50 23990±n/a nM
Citation PubChem, PC Profiling Assay to determine GST-GSH interactions in multiplex bead-based assays (HPSMTB buffer) PubChem Bioassay(2008)[AID]
 
Glutathione S-transferase Mu 1
Name:Glutathione S-transferase Mu 1
Type:PROTEIN
Mol. Mass.:25712.03
Organism:Homo sapiens (Human)
Description:ChEMBL_799596
Residue:218
BDBM33162
NameBDBM33162
Synonyms:(4E)-2,3-dihydroxy-4-[[2-(2-morpholin-4-ylsulfonyl-4-nitrophenyl)hydrazinyl]methylidene]cyclohexa-2,5-dien-1-one (4E)-2,3-dihydroxy-4-[[[2-(4-morpholinylsulfonyl)-4-nitrophenyl]hydrazo]methylidene]-1-cyclohexa-2,5-dienone MLS000336720 cid_6014955
TypeSmall organic molecule
Emp. Form.C17H18N4O8S
Mol. Mass.438.412
SMILESOc1c([O-])ccc(C[NH+]=Nc2ccc(cc2S(=O)(=O)N2CCOCC2)[N+]([O-])=O)c1O