Reaction Details
TargetGlutathione S-transferase Mu 1
LigandBDBM32318
Substrate/Competitorn/a
Meas. Tech.Profiling Assay to determine GST-GSH interactions in multiplex bead-based assays (HPSMTB buffer)
EC50 690±n/a nM
Citation PubChem, PC Profiling Assay to determine GST-GSH interactions in multiplex bead-based assays (HPSMTB buffer) PubChem Bioassay(2008)[AID]
 
Glutathione S-transferase Mu 1
Name:Glutathione S-transferase Mu 1
Type:PROTEIN
Mol. Mass.:25712.03
Organism:Homo sapiens (Human)
Description:ChEMBL_799596
Residue:218
BDBM32318
NameBDBM32318
Synonyms:4-[[4-(2-methyl-3-imidazo[1,2-a]pyrimidinyl)-2-thiazolyl]amino]phenol;hydrobromide 4-[[4-(2-methylimidazo[1,2-a]pyrimidin-3-yl)thiazol-2-yl]amino]phenol;hydrobromide SMR000277160 | cid_5337459
TypeSmall organic molecule
Emp. Form.C16H13N5OS
Mol. Mass.323.372
SMILESCc1nc2ncccn2c1-c1csc(Nc2ccc(O)cc2)n1