Reaction Details
TargetGlutathione S-transferase Mu 1
LigandBDBM46297
Substrate/Competitorn/a
Meas. Tech.Profiling Assay to determine GST-GSH interactions in multiplex bead-based assays (HPSMTB buffer)
EC50 42840±n/a nM
Citation PubChem, PC Profiling Assay to determine GST-GSH interactions in multiplex bead-based assays (HPSMTB buffer) PubChem Bioassay(2008)[AID]
 
Glutathione S-transferase Mu 1
Name:Glutathione S-transferase Mu 1
Type:PROTEIN
Mol. Mass.:25712.03
Organism:Homo sapiens (Human)
Description:ChEMBL_799596
Residue:218
BDBM46297
NameBDBM46297
Synonyms:2-[(1,1-diketo-1,2-benzothiazol-3-yl)-(4-pyridylmethyleneamino)amino]ethanol;hydrochloride 2-[[1,1-bis(oxidanylidene)-1,2-benzothiazol-3-yl]-(pyridin-4-ylmethylideneamino)amino]ethanol;hydrochloride SMR000313025 isonicotinaldehyde (1,1-dioxido-1,2-benzisothiazol-3-yl)(2-hydroxyethyl)hydrazone
TypeSmall organic molecule
Emp. Form.C15H14N4O3S
Mol. Mass.330.362
SMILESOCCN(N=Cc1ccncc1)C1=NS(=O)(=O)c2ccccc12