Reaction Details
TargetGlutathione S-transferase Mu 1
LigandBDBM32325
Substrate/Competitorn/a
Meas. Tech.Profiling Assay to determine GST-GSH interactions in multiplex bead-based assays (HPSMTB buffer)
EC50 2020±n/a nM
Citation PubChem, PC Profiling Assay to determine GST-GSH interactions in multiplex bead-based assays (HPSMTB buffer) PubChem Bioassay(2008)[AID]
 
Glutathione S-transferase Mu 1
Name:Glutathione S-transferase Mu 1
Type:PROTEIN
Mol. Mass.:25712.03
Organism:Homo sapiens (Human)
Description:ChEMBL_799596
Residue:218
BDBM32325
NameBDBM32325
Synonyms:1-(3-chlorophenyl)-3-(2-pyridin-3-ylpyrimidin-4-yl)urea 1-(3-chlorophenyl)-3-[2-(3-pyridyl)pyrimidin-4-yl]urea N-(3-chlorophenyl)-N'-[2-(3-pyridinyl)-4-pyrimidinyl]urea cid_1488502
TypeSmall organic molecule
Emp. Form.C16H12ClN5O
Mol. Mass.325.752
SMILESClc1cccc(NC(=O)Nc2ccnc(n2)-c2cccnc2)c1