Reaction Details
TargetGlutathione S-transferase Mu 1
LigandBDBM33189
Substrate/Competitorn/a
Meas. Tech.Profiling Assay to determine GST-GSH interactions in multiplex bead-based assays (HPSMTB buffer)
EC50 46320±n/a nM
Citation PubChem, PC Profiling Assay to determine GST-GSH interactions in multiplex bead-based assays (HPSMTB buffer) PubChem Bioassay(2008)[AID]
 
Glutathione S-transferase Mu 1
Name:Glutathione S-transferase Mu 1
Type:PROTEIN
Mol. Mass.:25712.03
Organism:Homo sapiens (Human)
Description:ChEMBL_799596
Residue:218
BDBM33189
NameBDBM33189
Synonyms:MLS000727927 N-[(2,4-dimethoxy-5-nitro-benzylidene)amino]isonicotinamide N-[(2,4-dimethoxy-5-nitrophenyl)methylideneamino]-4-pyridinecarboxamide N-[(E)-(2,4-dimethoxy-5-nitro-benzylidene)amino]isonicotinamide cid_1510791
TypeSmall organic molecule
Emp. Form.C15H14N4O5
Mol. Mass.330.2955
SMILESCOc1cc(OC)c(cc1[CH+][N-]NC(=O)c1ccncc1)[N+]([O-])=O