Reaction Details
TargetGlutathione S-transferase Mu 1
LigandBDBM32328
Substrate/Competitorn/a
Meas. Tech.Profiling Assay to determine GST-GSH interactions in multiplex bead-based assays (HPSMTB buffer)
EC50 3630±n/a nM
Citation PubChem, PC Profiling Assay to determine GST-GSH interactions in multiplex bead-based assays (HPSMTB buffer) PubChem Bioassay(2008)[AID]
 
Glutathione S-transferase Mu 1
Name:Glutathione S-transferase Mu 1
Type:PROTEIN
Mol. Mass.:25712.03
Organism:Homo sapiens (Human)
Description:ChEMBL_799596
Residue:218
BDBM32328
NameBDBM32328
Synonyms:4-[2-[(6,7-dimethoxy-2-sulfanylidene-1H-quinazolin-4-yl)amino]ethyl]benzenesulfonamide 4-{2-[(6,7-dimethoxy-2-thioxo-1,2-dihydroquinazolin-4-yl)amino]ethyl}benzenesulfonamide SMR000314043 | cid_16195481
TypeSmall organic molecule
Emp. Form.C18H20N4O4S2
Mol. Mass.420.506
SMILESCOc1cc2nc(=S)[nH]c(NCCc3ccc(cc3)S(N)(=O)=O)c2cc1OC