Reaction Details
TargetGlutathione S-transferase Mu 1
LigandBDBM32330
Substrate/Competitorn/a
Meas. Tech.Profiling Assay to determine GST-GSH interactions in multiplex bead-based assays (HPSMTB buffer)
EC50 4780±n/a nM
Citation PubChem, PC Profiling Assay to determine GST-GSH interactions in multiplex bead-based assays (HPSMTB buffer) PubChem Bioassay(2008)[AID]
 
Glutathione S-transferase Mu 1
Name:Glutathione S-transferase Mu 1
Type:PROTEIN
Mol. Mass.:25712.03
Organism:Homo sapiens (Human)
Description:ChEMBL_799596
Residue:218
BDBM32330
NameBDBM32330
Synonyms:(2Z)-2-(5-fluoranyl-2-oxidanylidene-indol-3-yl)-2-(4-methyl-3H-1,3-thiazol-2-ylidene)ethanenitrile (2Z)-2-(5-fluoro-2-oxo-3-indolyl)-2-(4-methyl-3H-thiazol-2-ylidene)acetonitrile MLS001011168 cid_16196155
TypeSmall organic molecule
Emp. Form.C14H8FN3OS
Mol. Mass.285.296
SMILESCc1csc(n1)C(C#N)=C1C(=O)Nc2ccc(F)cc12