Reaction Details
TargetBcl-2-like protein 10 [11-204]
LigandBDBM32280
Substrate/Competitorn/a
Meas. Tech.Multiplexed high-throughput screen for small molecule regulators of Bcl-2 family protein interactions, specifically Bim-Bcl-B protein.
EC50 33670±n/a nM
Citation PubChem, PC Multiplexed high-throughput screen for small molecule regulators of Bcl-2 family protein interactions, specifically Bim-Bcl-B protein. PubChem Bioassay(2008)[AID]
 
Bcl-2-like protein 10 [11-204]
Name:Bcl-2-like protein 10 [11-204]
Type:Enzyme Catalytic Domain
Mol. Mass.:21981.77
Organism:Homo sapiens (Human)
Description:gi_23396469
Residue:194
BDBM32280
NameBDBM32280
Synonyms:MLS000534769 N-(4-acetylphenyl)-2,3-bis(2-furyl)quinoxaline-6-carboxamide N-(4-acetylphenyl)-2,3-di-2-furyl-6-quinoxalinecarboxamide SMR000142225 | cid_1331726
TypeSmall organic molecule
Emp. Form.C25H17N3O4
Mol. Mass.423.4202
SMILESCC(=O)c1ccc(NC(=O)c2ccc3nc(-c4ccco4)c(nc3c2)-c2ccco2)cc1