Reaction Details
TargetBcl-2-like protein 2
LigandBDBM32270
Substrate/Competitorn/a
Meas. Tech.Multiplexed dose response screen for small molecule regulators of Bcl-2 family protein interactions, specifically Bim-Bcl-W.
EC50 4620±n/a nM
Citation PubChem, PC Multiplexed dose response screen for small molecule regulators of Bcl-2 family protein interactions, specifically Bim-Bcl-W. PubChem Bioassay(2008)[AID]
 
Bcl-2-like protein 2
Name:Bcl-2-like protein 2
Type:Protein
Mol. Mass.:20742.61
Organism:Homo sapiens (Human)
Description:n/a
Residue:193
BDBM32270
NameBDBM32270
Synonyms:6,7-dimethoxy-4-(2-oxolanylmethylamino)-1H-quinazoline-2-thione 6,7-dimethoxy-4-(tetrahydrofurfurylamino)-1H-quinazoline-2-thione MLS000045008 cid_3243470
TypeSmall organic molecule
Emp. Form.C15H19N3O3S
Mol. Mass.321.395
SMILESCOc1cc2nc(=S)[nH]c(NCC3CCCO3)c2cc1OC