Reaction Details
TargetAlkaline phosphatase, germ cell type
LigandBDBM50309567
Substrate/Competitorn/a
Meas. Tech.Luminescent assay for HTS discovery of chemical inhibitors of placental alkaline phosphatase confirmation
IC50 2950±n/a nM
Citation PubChem, PC Luminescent assay for HTS discovery of chemical inhibitors of placental alkaline phosphatase confirmation PubChem Bioassay(2009)[AID]
 
Alkaline phosphatase, germ cell type
Name:Alkaline phosphatase, germ cell type
Type:PROTEIN
Mol. Mass.:57374.31
Organism:Homo sapiens (Human)
Description:ChEMBL_29964
Residue:532
BDBM50309567
NameBDBM50309567
Synonyms:3-(2-(3,4-dihydroxyphenyl)-2-oxoethyl)-6,7-dimethoxyisobenzofuran-1(3H)-one cid_2940433
TypeSmall organic molecule
Emp. Form.C18H16O7
Mol. Mass.344.3154
SMILESCOc1ccc2C(CC(=O)c3ccc(O)c(O)c3)OC(=O)c2c1OC