Reaction Details
TargetAlkaline phosphatase, germ cell type
LigandBDBM50309564
Substrate/Competitorn/a
Meas. Tech.Luminescent assay for HTS discovery of chemical inhibitors of placental alkaline phosphatase confirmation
IC50 2490±n/a nM
Citation PubChem, PC Luminescent assay for HTS discovery of chemical inhibitors of placental alkaline phosphatase confirmation PubChem Bioassay(2009)[AID]
 
Alkaline phosphatase, germ cell type
Name:Alkaline phosphatase, germ cell type
Type:PROTEIN
Mol. Mass.:57374.31
Organism:Homo sapiens (Human)
Description:ChEMBL_29964
Residue:532
BDBM50309564
NameBDBM50309564
Synonyms:1-(3,4-dihydroxyphenyl)-2-(4,6-dimethylpyrimidin-2-ylthio)ethanone cid_715454
TypeSmall organic molecule
Emp. Form.C14H14N2O3S
Mol. Mass.290.338
SMILESCc1cc(C)nc(SCC(=O)c2ccc(O)c(O)c2)n1