Reaction Details
TargetAlkaline phosphatase, germ cell type
LigandBDBM46022
Substrate/Competitorn/a
Meas. Tech.Luminescent assay for HTS discovery of chemical inhibitors of placental alkaline phosphatase confirmation
IC50 1890±n/a nM
Citation PubChem, PC Luminescent assay for HTS discovery of chemical inhibitors of placental alkaline phosphatase confirmation PubChem Bioassay(2009)[AID]
 
Alkaline phosphatase, germ cell type
Name:Alkaline phosphatase, germ cell type
Type:PROTEIN
Mol. Mass.:57374.31
Organism:Homo sapiens (Human)
Description:ChEMBL_29964
Residue:532
BDBM46022
NameBDBM46022
Synonyms:1-(3,4-dihydroxyphenyl)-2-[1-(4-fluorophenyl)tetrazol-5-yl]sulfanylethanone 1-(3,4-dihydroxyphenyl)-2-[[1-(4-fluorophenyl)tetrazol-5-yl]thio]ethanone MLS-0238024.0001 | cid_713665
TypeSmall organic molecule
Emp. Form.C15H11FN4O3S
Mol. Mass.346.336
SMILESOc1ccc(cc1O)C(=O)CSc1nnnn1-c1ccc(F)cc1