Reaction Details
TargetAlkaline phosphatase, germ cell type
LigandBDBM46023
Substrate/Competitorn/a
Meas. Tech.Luminescent assay for HTS discovery of chemical inhibitors of placental alkaline phosphatase confirmation
IC50 1760±n/a nM
Citation PubChem, PC Luminescent assay for HTS discovery of chemical inhibitors of placental alkaline phosphatase confirmation PubChem Bioassay(2009)[AID]
 
Alkaline phosphatase, germ cell type
Name:Alkaline phosphatase, germ cell type
Type:PROTEIN
Mol. Mass.:57374.31
Organism:Homo sapiens (Human)
Description:ChEMBL_29964
Residue:532
BDBM46023
NameBDBM46023
Synonyms:4-[5-[2-(3,4-dihydroxyphenyl)-2-oxoethyl]sulfanyltetrazol-1-yl]benzamide 4-[5-[[2-(3,4-dihydroxyphenyl)-2-keto-ethyl]thio]tetrazol-1-yl]benzamide MLS-0255212.0001 | cid_2010274
TypeSmall organic molecule
Emp. Form.C16H13N5O4S
Mol. Mass.371.371
SMILESNC(=O)c1ccc(cc1)-n1nnnc1SCC(=O)c1ccc(O)c(O)c1