Reaction Details
TargetAlkaline phosphatase, germ cell type
LigandBDBM50068635
Substrate/Competitorn/a
Meas. Tech.Luminescent assay for HTS discovery of chemical inhibitors of placental alkaline phosphatase confirmation
IC50 3060±n/a nM
Citation PubChem, PC Luminescent assay for HTS discovery of chemical inhibitors of placental alkaline phosphatase confirmation PubChem Bioassay(2009)[AID]
 
Alkaline phosphatase, germ cell type
Name:Alkaline phosphatase, germ cell type
Type:PROTEIN
Mol. Mass.:57374.31
Organism:Homo sapiens (Human)
Description:ChEMBL_29964
Residue:532
BDBM50068635
NameBDBM50068635
Synonyms:2-(Benzooxazol-2-ylsulfanyl)-1-(3,4-dihydroxy-phenyl)-ethanone cid_4450383
TypeSmall organic molecule
Emp. Form.C15H11NO4S
Mol. Mass.301.317
SMILESOc1ccc(cc1O)C(=O)CSc1nc2ccccc2o1