Reaction Details
TargetAlkaline phosphatase, germ cell type
LigandBDBM39584
Substrate/Competitorn/a
Meas. Tech.Luminescent assay for HTS discovery of chemical inhibitors of placental alkaline phosphatase confirmation
IC50 2730±n/a nM
Citation PubChem, PC Luminescent assay for HTS discovery of chemical inhibitors of placental alkaline phosphatase confirmation PubChem Bioassay(2009)[AID]
 
Alkaline phosphatase, germ cell type
Name:Alkaline phosphatase, germ cell type
Type:PROTEIN
Mol. Mass.:57374.31
Organism:Homo sapiens (Human)
Description:ChEMBL_29964
Residue:532
BDBM39584
NameBDBM39584
Synonyms:5,6-Dimethyl-2-[1-(1-thiophen-2-ylmethyl-1H-tetrazol-5-ylmethyl)-piperidin-4-yl]-1H-benzoimidazole 5,6-dimethyl-2-[1-[[1-(thiophen-2-ylmethyl)-1,2,3,4-tetrazol-5-yl]methyl]piperidin-4-yl]-1H-benzimidazole 5,6-dimethyl-2-[1-[[1-(thiophen-2-ylmethyl)tetrazol-5-yl]methyl]piperidin-4-yl]-1H-benzimidazole SMR000007065 | cid_655425
TypeSmall organic molecule
Emp. Form.C21H25N7S
Mol. Mass.407.535
SMILESCc1cc2nc([nH]c2cc1C)C1CCN(Cc2nnnn2Cc2cccs2)CC1