Reaction Details
TargetAlkaline phosphatase, germ cell type
LigandBDBM41887
Substrate/Competitorn/a
Meas. Tech.Luminescent assay for HTS discovery of chemical inhibitors of placental alkaline phosphatase confirmation
IC50 2110±n/a nM
Citation PubChem, PC Luminescent assay for HTS discovery of chemical inhibitors of placental alkaline phosphatase confirmation PubChem Bioassay(2009)[AID]
 
Alkaline phosphatase, germ cell type
Name:Alkaline phosphatase, germ cell type
Type:PROTEIN
Mol. Mass.:57374.31
Organism:Homo sapiens (Human)
Description:ChEMBL_29964
Residue:532
BDBM41887
NameBDBM41887
Synonyms:1-(3,4-dihydroxyphenyl)-2-(1-imidazolyl)ethanone;hydrochloride 1-(3,4-dihydroxyphenyl)-2-imidazol-1-ylethanone;hydrochloride CHEMBL349641 cid_25067472 | cid_52780
TypeSmall organic molecule
Emp. Form.C11H10N2O3
Mol. Mass.218.2087
SMILESOc1ccc(cc1O)C(=O)Cn1ccnc1