Reaction Details
TargetAlkaline phosphatase, germ cell type
LigandBDBM41889
Substrate/Competitorn/a
Meas. Tech.Luminescent assay for HTS discovery of chemical inhibitors of placental alkaline phosphatase confirmation
IC50 2370±n/a nM
Citation PubChem, PC Luminescent assay for HTS discovery of chemical inhibitors of placental alkaline phosphatase confirmation PubChem Bioassay(2009)[AID]
 
Alkaline phosphatase, germ cell type
Name:Alkaline phosphatase, germ cell type
Type:PROTEIN
Mol. Mass.:57374.31
Organism:Homo sapiens (Human)
Description:ChEMBL_29964
Residue:532
BDBM41889
NameBDBM41889
Synonyms:1-(3,4-dihydroxyphenyl)-2-(2-methyl-1-imidazolyl)ethanone;hydrochloride 1-[3,4-bis(oxidanyl)phenyl]-2-(2-methylimidazol-1-yl)ethanone;hydrochloride MLS-0315852.0001 | cid_25067491
TypeSmall organic molecule
Emp. Form.C12H12N2O3
Mol. Mass.232.2353
SMILESCc1nccn1CC(=O)c1ccc(O)c(O)c1