Reaction Details
TargetAlkaline phosphatase, germ cell type
LigandBDBM41890
Substrate/Competitorn/a
Meas. Tech.Luminescent assay for HTS discovery of chemical inhibitors of placental alkaline phosphatase confirmation
IC50 1530±n/a nM
Citation PubChem, PC Luminescent assay for HTS discovery of chemical inhibitors of placental alkaline phosphatase confirmation PubChem Bioassay(2009)[AID]
 
Alkaline phosphatase, germ cell type
Name:Alkaline phosphatase, germ cell type
Type:PROTEIN
Mol. Mass.:57374.31
Organism:Homo sapiens (Human)
Description:ChEMBL_29964
Residue:532
BDBM41890
NameBDBM41890
Synonyms:2-(1-benzimidazolyl)-1-(3,4-dihydroxyphenyl)ethanone;hydrochloride 2-(benzimidazol-1-yl)-1-[3,4-bis(oxidanyl)phenyl]ethanone;hydrochloride MLS-0315853.0001 | cid_25067493
TypeSmall organic molecule
Emp. Form.C15H12N2O3
Mol. Mass.268.2674
SMILESOc1ccc(cc1O)C(=O)Cn1cnc2ccccc12