Reaction Details
TargetAlkaline phosphatase, germ cell type
LigandBDBM41891
Substrate/Competitorn/a
Meas. Tech.Luminescent assay for HTS discovery of chemical inhibitors of placental alkaline phosphatase confirmation
IC50 2510±n/a nM
Citation PubChem, PC Luminescent assay for HTS discovery of chemical inhibitors of placental alkaline phosphatase confirmation PubChem Bioassay(2009)[AID]
 
Alkaline phosphatase, germ cell type
Name:Alkaline phosphatase, germ cell type
Type:PROTEIN
Mol. Mass.:57374.31
Organism:Homo sapiens (Human)
Description:ChEMBL_29964
Residue:532
BDBM41891
NameBDBM41891
Synonyms:1-(3,4-dihydroxyphenyl)-2-(2-methyl-1-benzimidazolyl)ethanone;hydrochloride 1-[3,4-bis(oxidanyl)phenyl]-2-(2-methylbenzimidazol-1-yl)ethanone;hydrochloride MLS-0315854.0001 | cid_25067495
TypeSmall organic molecule
Emp. Form.C16H14N2O3
Mol. Mass.282.294
SMILESCc1nc2ccccc2n1CC(=O)c1ccc(O)c(O)c1